Butane, 1-chloro-2,3-dimethyl

Phase change data

Data compiled by: Thermodynamics Research Center, NIST Boulder Laboratories, Chris Muzny director

Quantity Value Units Method Reference Comment
Tboil397.15KN/ASilva, 1874Uncertainty assigned by TRC = 4. K

In addition to the Thermodynamics Research Center (TRC) data available from this site, much more physical and chemical property data is available from the following TRC products:

References

Silva, 1874
Silva, R.D., Chem. Ber., 1874, 7, 953. [all data]