Carbamic acid, methyl ester

Gas phase thermochemistry data

Data compiled by: Hussein Y. Afeefy, Joel F. Liebman, and Stephen E. Stein

Quantity Value Units Method Reference Comment
Δfgas-425.3kJ/molCmBernard, Boukari, et al., 1976hfusion=16.7±0.8kJ/mol

References

Bernard, Boukari, et al., 1976
Bernard, M.A.; Boukari, Y.; Busnot, F., Thermodynamic study of methyl and ethyl carbamates and their eutectic, Thermochim. Acta, 1976, 16, 267-275. [all data]