Carbo selenide

Phase change data

Data compiled as indicated in comments:
AC - William E. Acree, Jr., James S. Chickos

Enthalpy of vaporization

ΔvapH (kJ/mol) Temperature (K) Reference Comment
35.5241.Dykyj, Svoboda, et al., 1999Based on data from 226. - 359. K.; AC
33.6288.Stock and Willfroth, 1914Based on data from 273. - 357. K. See also Boublik, Fried, et al., 1984.; AC

Antoine Equation Parameters

log10(P) = A − (B / (T + C))
    P = vapor pressure (bar)
    T = temperature (K)

View plot Requires a JavaScript / HTML 5 canvas capable browser.

Temperature (K) A B C Reference Comment
273. - 357.3.944651227.514-46.146Stock and Willfroth, 1914Coefficents calculated by NIST from author's data.

References

Dykyj, Svoboda, et al., 1999
Dykyj, J.; Svoboda, J.; Wilhoit, R.C.; Frenkel, M.L.; Hall, K.R., Vapor Pressure of Chemicals: Part A. Vapor Pressure and Antoine Constants for Hydrocarbons and Sulfur, Selenium, Tellurium and Hydrogen Containing Organic Compounds, Springer, Berlin, 1999, 373. [all data]

Stock and Willfroth, 1914
Stock, Alfred; Willfroth, Ernst, Selen-Schwefel-kohlenstoff, CSSe, Ber. Dtsch. Chem. Ges., 1914, 47, 1, 144-154, https://doi.org/10.1002/cber.19140470124 . [all data]

Boublik, Fried, et al., 1984
Boublik, T.; Fried, V.; Hala, E., The Vapour Pressures of Pure Substances: Selected Values of the Temperature Dependence of the Vapour Pressures of Some Pure Substances in the Normal and Low Pressure Region, 2nd ed., Elsevier, New York, 1984, 972. [all data]