Ethane, hexabromo-

Vibrational and/or electronic energy levels

Data compiled by: Takehiko Shimanouchi

Symmetry:   D3d     Symmetry Number σ = 6

 Sym.   No   Approximate   Selected Freq.  Infrared   Raman   Comments
 Species   type of mode   Value   Rating   Value  Phase  Value  Phase

ag 1 CC str 940  C  ia 940 M sln.
ag 2 CBr3 s-str 255  C  ia 255 VS p sln.
ag 3 CBr3 s-deform 120  C  ia 120 W sln.
a1u 4 Torsion 51  D  ia  ia OC410411)
a2u 5 CBr3 s-str 559  C 559 S sln.  ia
a2u 6 CBr3 s-deform 254  C 254 S sln.  ia
eg 7 CBr3 d-str 768  C  ia 768 M dp sln.
eg 8 CBr3 d-deform 204  C  ia 204 S dp sln.
eg 9 CBr3 rock 139  C  ia 139 M sln.
eu 10 CBr3 d-str 656  C 656 VS sln.  ia
eu 11 CBr3 d-deform 168  C 168 S sln.  ia
eu 12 CBr3 rock 82  C 82 M sln.  ia

Source: Shimanouchi, 1972

References

Shimanouchi, 1972
Shimanouchi, T., Tables of Molecular Vibrational Frequencies Consolidated Volume I, National Bureau of Standards, 1972, 1-160. [all data]