2-tert-Butylpyridine

Phase change data

Data compiled as indicated in comments:
BS - Robert L. Brown and Stephen E. Stein
TRC - Thermodynamics Research Center, NIST Boulder Laboratories, Chris Muzny director

Quantity Value Units Method Reference Comment
Tfus240.35KN/ABrown and Murphey, 1951Uncertainty assigned by TRC = 0.3 K; TRC

Reduced pressure boiling point

Tboil (K) Pressure (bar) Reference Comment
442.20.991Weast and Grasselli, 1989BS

In addition to the Thermodynamics Research Center (TRC) data available from this site, much more physical and chemical property data is available from the following TRC products:

References

Brown and Murphey, 1951
Brown, H.C.; Murphey, W.A., A convenient synthesis of the monoalkylpyridines; a new prototropic reaction of 3-picoline, J. Am. Chem. Soc., 1951, 73, 3308. [all data]

Weast and Grasselli, 1989
CRC Handbook of Data on Organic Compounds, 2nd Editon, Weast,R.C and Grasselli, J.G., ed(s)., CRC Press, Inc., Boca Raton, FL, 1989, 1. [all data]