Dichloromethyltrimethylsilane

Gas phase ion energetics data

Data compiled by: Sharon G. Lias, Rhoda D. Levin, and Sherif A. Kafafi

Ionization energy determinations

IE (eV) Method Reference Comment
10.25PEZykov, Khvostenko, et al., 1981Vertical value

References

Zykov, Khvostenko, et al., 1981
Zykov, B.G.; Khvostenko, V.I.; Voronkov, M.G.; Yur'ev, V.P.; Lomakin, G.S.; Suslova, E.N., Photoelectron spectra of Si-substituted chloromethylsilanes, Dokl. Akad. Nauk SSSR, 1981, 258, 135. [all data]