Dihydroterpineol

Kovats' RI, non-polar column, temperature ramp

View large format table.

Column type Active phase I Reference Comment
CapillaryHP-51142.Ramos, Siani, et al., 200030. m/0.32 mm/0.25 μm, He, 3. K/min; Tstart: 70. C; Tend: 250. C

References

Ramos, Siani, et al., 2000
Ramos, M.F.S.; Siani, A.C.; Tappin, M.R.R.; Guimaraes, A.C.; Lahoz, J.E.; Ribeiro, J.E.L.S., Essential oils from oleoresins of Protium spp. of the Amazon region, Flavour Fragr. J., 2000, 15, 6, 383-387, https://doi.org/10.1002/1099-1026(200011/12)15:6<383::AID-FFJ927>3.0.CO;2-X . [all data]