Urea, N'-(3-chlorophenyl)-N,N-dimethyl-

Reaction thermochemistry data

Data compiled by: Hussein Y. Afeefy, Joel F. Liebman, and Stephen E. Stein

Individual Reactions

Urea, N'-(3-chlorophenyl)-N,N-dimethyl- = Dimethylamine + Benzene, 1-chloro-3-isocyanato-

By formula: C9H11ClN2O = C2H7N + C7H4ClNO

Quantity Value Units Method Reference Comment
Δr148.0 ± 1.8kJ/molEqkChimishkyan, Svetlova, et al., 1984solid phase; Dissociation

References

Chimishkyan, Svetlova, et al., 1984
Chimishkyan, A.L.; Svetlova, L.P.; Leonova, T.V.; Gluyaev, N.D., Thermal decomposition of substituted ureas, J. Gen. Chem. USSR, 1984, 54, 1317-1320. [all data]