3-Butanone,1-(2,3,6-trimethylphenyl)-

Van Den Dool and Kratz RI, non-polar column, temperature ramp

View large format table.

Column type Active phase I Reference Comment
CapillaryBP-11445.Strauss, Dimitriadis, et al., 1986140. C @ 10. min, 2. K/min; Column length: 25. m; Phase thickness: 0.5 μm; Tend: 280. C

Van Den Dool and Kratz RI, polar column, temperature ramp

View large format table.

Column type Active phase I Reference Comment
CapillaryDB-Wax2193.Winterhalter, 199130. m/0.25 mm/0.25 μm, He, 50. C @ 3. min, 4. K/min; Tend: 240. C

References

Strauss, Dimitriadis, et al., 1986
Strauss, C.R.; Dimitriadis, E.; Wilson, B.; Williams, P.J., Studies on the hydrolysis of two megastigma-3,6,9-triols rationalizing the origins of some volatile C13 norisoprenoids of vitis vinifera grapes, J. Agric. Food Chem., 1986, 34, 1, 145-149, https://doi.org/10.1021/jf00067a039 . [all data]

Winterhalter, 1991
Winterhalter, P., 1,1,6-Trimethyl-1,2-dihydronaphthalene (TDN) Formation in Wine. 1. Studies on the Hydrolysis of 2,6,10,10-Tetramethyl-l-oxaspiro[4.5]dec-6-ene-2,8-diol Rationalizing the Origin of TDN and Related C13 Norisoprenoids in Riesling Wine, J. Agric. Food Chem., 1991, 39, 10, 1825-1829, https://doi.org/10.1021/jf00010a027 . [all data]