Benzene, 1-bromo-3-nitro-

Phase change data

Data compiled as indicated in comments:
TRC - Thermodynamics Research Center, NIST Boulder Laboratories, Chris Muzny director
AC - William E. Acree, Jr., James S. Chickos

Quantity Value Units Method Reference Comment
Tfus327.65KN/ABeringer, Brierley, et al., 1953Uncertainty assigned by TRC = 1.5 K; TRC
Tfus327.KN/ATimmermans, 1935Uncertainty assigned by TRC = 1.5 K; TRC
Tfus329.15KN/ABruhl, 1897Uncertainty assigned by TRC = 3. K; TRC
Quantity Value Units Method Reference Comment
Δsub86.8 ± 0.5kJ/molMERibeiro da Silva, Lobo Ferreira, et al., 2010Based on data from 280. - 295. K.; AC

Enthalpy of sublimation

ΔsubH (kJ/mol) Temperature (K) Method Reference Comment
87.0 ± 0.5287.MERibeiro da Silva, Lobo Ferreira, et al., 2010Based on data from 280. - 295. K.; AC

In addition to the Thermodynamics Research Center (TRC) data available from this site, much more physical and chemical property data is available from the following TRC products:

References

Beringer, Brierley, et al., 1953
Beringer, F.M.; Brierley, A.; Drexler, M.; Gindler, E.M.; Lumpkin, C.C., Diaryliodonium Salts II. The Phenylation of Organic and Inorganic Bases, J. Am. Chem. Soc., 1953, 75, 2708. [all data]

Timmermans, 1935
Timmermans, J., Researches in Stoichiometry. I. The Heat of Fusion of Organic Compounds., Bull. Soc. Chim. Belg., 1935, 44, 17-40. [all data]

Bruhl, 1897
Bruhl, J.W., Spectrochemistry of nitrogen containing compounds V, Z. Phys. Chem., Stoechiom. Verwandtschaftsl., 1897, 22, 373. [all data]

Ribeiro da Silva, Lobo Ferreira, et al., 2010
Ribeiro da Silva, Manuel A.V.; Lobo Ferreira, Ana I.M.C.; Santos, Ana Filipa L.O.M.; Rocha, Inês M., Thermochemical study of the monobromonitrobenzene isomers, The Journal of Chemical Thermodynamics, 2010, 42, 2, 169-176, https://doi.org/10.1016/j.jct.2009.06.008 . [all data]