9,10-Dimethylbenz(a)anthracene

Phase change data

Data compiled by: Thermodynamics Research Center, NIST Boulder Laboratories, Chris Muzny director

Quantity Value Units Method Reference Comment
Tfus396.4KN/AKelley and Rice, 1964Uncertainty assigned by TRC = 0.8 K

In addition to the Thermodynamics Research Center (TRC) data available from this site, much more physical and chemical property data is available from the following TRC products:

References

Kelley and Rice, 1964
Kelley, J.D.; Rice, F.O., The Vapor Presures of Some Polynumclear Aromatic Hydrocarbons, J. Phys. Chem., 1964, 68, 3794-6. [all data]