Bicyclo[1.1.0]but-1(3)-ene

Gas phase thermochemistry data

Data compiled by: Hussein Y. Afeefy, Joel F. Liebman, and Stephen E. Stein

Quantity Value Units Method Reference Comment
Δfgas544. ± 42.kJ/molIonChou and Kass, 1991

References

Chou and Kass, 1991
Chou, P.K.; Kass, S.R., C4H4 negative ions: Formation of the bicyclo[1.1.0]but-1(3)-ene radical anion and an experimental determination of the heat of formation of bicyclo[1.1.0]but-1(3)-ene, J. Am. Chem. Soc., 1991, 113, 697-698. [all data]