Acetamide, N-methoxy

Gas phase ion energetics data

Data evaluated as indicated in comments:
HL - Edward P. Hunter and Sharon G. Lias

Data compiled as indicated in comments:
B - John E. Bartmess

Quantity Value Units Method Reference Comment
Proton affinity (review)879.0kJ/molN/AHunter and Lias, 1998HL
Quantity Value Units Method Reference Comment
Gas basicity848.0kJ/molN/AHunter and Lias, 1998HL

De-protonation reactions

C3H6NO2- + Hydrogen cation = Acetamide, N-methoxy

By formula: C3H6NO2- + H+ = C3H7NO2

Quantity Value Units Method Reference Comment
Δr1469. ± 8.8kJ/molG+TSDecouzon, Exner, et al., 1990gas phase; Acid: O-methyl acetohydroxamic acid; B
Quantity Value Units Method Reference Comment
Δr1438. ± 8.4kJ/molIMREDecouzon, Exner, et al., 1990gas phase; Acid: O-methyl acetohydroxamic acid; B

Reaction thermochemistry data

Data compiled by: John E. Bartmess

Individual Reactions

C3H6NO2- + Hydrogen cation = Acetamide, N-methoxy

By formula: C3H6NO2- + H+ = C3H7NO2

Quantity Value Units Method Reference Comment
Δr1469. ± 8.8kJ/molG+TSDecouzon, Exner, et al., 1990gas phase; Acid: O-methyl acetohydroxamic acid
Quantity Value Units Method Reference Comment
Δr1438. ± 8.4kJ/molIMREDecouzon, Exner, et al., 1990gas phase; Acid: O-methyl acetohydroxamic acid

References

Hunter and Lias, 1998
Hunter, E.P.; Lias, S.G., Evaluated Gas Phase Basicities and Proton Affinities of Molecules: An Update, J. Phys. Chem. Ref. Data, 1998, 27, 3, 413-656, https://doi.org/10.1063/1.556018 . [all data]

Decouzon, Exner, et al., 1990
Decouzon, M.; Exner, O.; Gal, J.-F.; Maria, P.-C., The Gas-Phase Acidity and the Acidic Site of Acetohydroxamic Acid: an FT-ICR Study, J. Org. Chem., 1990, 55, 13, 3980, https://doi.org/10.1021/jo00300a007 . [all data]