Hexacosanoic acid, methyl ester

Phase change data

Data compiled by: William E. Acree, Jr., James S. Chickos

Quantity Value Units Method Reference Comment
Δvap147.1 ± 4.5kJ/molCGCChickos, Zhao, et al., 2004Based on data from 467. - 558. K.

Enthalpy of fusion

ΔfusH (kJ/mol) Temperature (K) Method Reference
101.3336.2DSCChickos, Zhao, et al., 2004

Lee's RI, non-polar column, temperature ramp

Data compiled by: NIST Mass Spectrometry Data Center, William E. Wallace, director

Column type CapillaryCapillary
Active phase DB-1DB-1
Column length (m) 30.30.
Carrier gas
Substrate
Column diameter (mm) 0.20.2
Phase thickness (μm) 0.250.25
Tstart (C) 50.50.
Tend (C) 300.300.
Heat rate (K/min) 5.5.
Initial hold (min) 2.2.
Final hold (min) 5.5.
I 477.9477.8
ReferenceJohnson, Urso, et al., 1997Johnson, Urso, et al., 1997
Comment MSDC-RI MSDC-RI

Van Den Dool and Kratz RI, non-polar column, custom temperature program

Data compiled by: NIST Mass Spectrometry Data Center, William E. Wallace, director

Column type Capillary
Active phase HP-5MS
Column length (m) 30.
Carrier gas He
Substrate
Column diameter (mm) 0.25
Phase thickness (μm) 0.25
Program 60C (1 min) => 5 C/min => 210C => 10 C/min => 280C (15 min)
I 2929.2
ReferenceAndriamaharavo, 2014
Comment MSDC-RI

References

Chickos, Zhao, et al., 2004
Chickos, James S.; Zhao, Hui; Nichols, Gary, The vaporization enthalpies and vapor pressures of fatty acid methyl esters C18, C21 to C23, and C25 to C29 by correlation -- gas chromatography, Thermochimica Acta, 2004, 424, 1-2, 111-121, https://doi.org/10.1016/j.tca.2004.05.020 . [all data]