Benzoic acid, 2-methoxy-

Gas phase thermochemistry data

Data compiled by: Hussein Y. Afeefy, Joel F. Liebman, and Stephen E. Stein

Quantity Value Units Method Reference Comment
Δfgas-433.8 ± 1.2kJ/molCcbColomina, Jimenez, et al., 1978

References

Colomina, Jimenez, et al., 1978
Colomina, M.; Jimenez, P.; Roux, M.V.; Turrion, C., Thermochemical properties of benzoic acid derivatives VII. Enthalpies of combustion and formation of the o-, m-, and p-methoxy-benzoic acids, J. Chem. Thermodyn., 1978, 10, 661-665. [all data]