Benzene, 1-bromo-2-methoxy-

Gas phase ion energetics data

Data compiled by: Henry M. Rosenstock, Keith Draxl, Bruce W. Steiner, and John T. Herron

Ionization energy determinations

IE (eV) Method Reference
8.3 ± 0.15CTSVoigt and Reid, 1964

References

Voigt and Reid, 1964
Voigt, E.M.; Reid, C., Ionization potentials of substituted benzenes and their charge-transfer spectra with tetracyanoethylene, J. Am. Chem. Soc., 1964, 86, 3930. [all data]