Probenecid

Phase change data

Data compiled by: William E. Acree, Jr., James S. Chickos

Enthalpy of fusion

ΔfusH (kJ/mol) Temperature (K) Method Reference
33.57471.DSCPeña, Escalera, et al., 2009
40.9472.1DSCWassvik, Holmén, et al., 2006

References

Peña, Escalera, et al., 2009
Peña, M.A.; Escalera, B.; Reíllo, A.; Sánchez, A.B.; Bustamante, P., Thermodynamics of cosolvent action: Phenacetin, salicylic acid and probenecid, J. Pharm. Sci., 2009, 98, 3, 1129-1135, https://doi.org/10.1002/jps.21497 . [all data]

Wassvik, Holmén, et al., 2006
Wassvik, Carola M.; Holmén, Anders G.; Bergström, Christel A.S.; Zamora, Ismael; Artursson, Per, Contribution of solid-state properties to the aqueous solubility of drugs, European Journal of Pharmaceutical Sciences, 2006, 29, 3-4, 294-305, https://doi.org/10.1016/j.ejps.2006.05.013 . [all data]