1,2,4,5-Benzene-tetracarboxylic acid, dipropyl ester

Condensed phase thermochemistry data

Data compiled by: Hussein Y. Afeefy, Joel F. Liebman, and Stephen E. Stein

Quantity Value Units Method Reference Comment
Δfsolid-1644.2 ± 2.6kJ/molCcbVan-Chin-Syan, Dibrivnyi, et al., 1981
Quantity Value Units Method Reference Comment
Δcsolid-7224.4 ± 2.3kJ/molCcbVan-Chin-Syan, Dibrivnyi, et al., 1981Corresponding Δfsolid = -1644.2 kJ/mol (simple calculation by NIST; no Washburn corrections)

References

Van-Chin-Syan, Dibrivnyi, et al., 1981
Van-Chin-Syan, Y.; Dibrivnyi, V.N.; Donchak, V.A.; Chuchmarev, S.K., Standard enthalpies of combustion and formation of pyromellitic esters, Russ. J. Phys. Chem. (Engl. Transl.), 1981, 55, 747. [all data]