Germane,(4-chlorophenyl)trimethyl-

Gas phase ion energetics data

Data compiled by: Sharon G. Lias, Rhoda D. Levin, and Sherif A. Kafafi

Ionization energy determinations

IE (eV) Method Reference Comment
8.84PELimouzin and Maire, 1975Vertical value

References

Limouzin and Maire, 1975
Limouzin, Y.; Maire, J.C., Spectres photoelectroniques des composes organometalliques, J. Organomet. Chem., 1975, 92, 169. [all data]