Benzene, (1-methylenebutyl)-

Phase change data

Data compiled by: Thermodynamics Research Center, NIST Boulder Laboratories, Chris Muzny director

Quantity Value Units Method Reference Comment
Tboil474.15KN/AOverberger and Tanner, 1955Uncertainty assigned by TRC = 2. K

In addition to the Thermodynamics Research Center (TRC) data available from this site, much more physical and chemical property data is available from the following TRC products:

References

Overberger and Tanner, 1955
Overberger, C.G.; Tanner, D., Ionic Polymerization. A Convenient Synthesis of a.pha.- and β- Alkylstyrenes. THe Effect of an α-Alkyl Group on the Ultraviolet Absorption Spectra, J. Am. Chem. Soc., 1955, 77, 369. [all data]