Exo-2-isobutylidenetetrahydrofuran

Reaction thermochemistry data

Data compiled by: Hussein Y. Afeefy, Joel F. Liebman, and Stephen E. Stein

Individual Reactions

Exo-2-isobutylidenetetrahydrofuran = Endo-2-isobutylidenetetrahydrofuran

By formula: C8H14O = C8H14O

Quantity Value Units Method Reference Comment
Δr-2.9 ± 0.3kJ/molEqkTaskinen, 1975liquid phase; solvent: Cyclohexane; GLC

Exo-2-isobutylidenetetrahydrofuran = Furan, 2,3-dihydro-5-(2-methylpropyl)-

By formula: C8H14O = C8H14O

Quantity Value Units Method Reference Comment
Δr-3.0 ± 0.5kJ/molEqkTaskinen, 1975liquid phase; solvent: Cyclohexane; GLC

References

Taskinen, 1975
Taskinen, E., Thermodynamics of vinyl ethers. XII. The relative stabilities of 2-alkylidenetetrahydrofurans and 5-alkyl-1-2,3-dihydrofurans, Acta Chem. Scand., Ser. B, 1975, 29, 245-248. [all data]