p-n-Hexyloxybenzylideneamino-p'-fluorobenzene

Phase change data

Data compiled by: Eugene S. Domalski and Elizabeth D. Hearing

Enthalpy of fusion

ΔfusH (kJ/mol) Temperature (K) Reference Comment
23.220328.07Tsuji, Sorai, et al., 1982Crystal to smectic B.

Entropy of fusion

ΔfusS (J/mol*K) Temperature (K) Reference Comment
70.7328.07Tsuji, Sorai, et al., 1982Crystal

Enthalpy of phase transition

ΔHtrs (kJ/mol) Temperature (K) Initial Phase Final Phase Reference Comment
3.050330.33liquidliquidTsuji, Sorai, et al., 1982
3.410334.88liquidliquidTsuji, Sorai, et al., 1982
1.170336.33liquidliquidTsuji, Sorai, et al., 1982

Entropy of phase transition

ΔStrs (J/mol*K) Temperature (K) Initial Phase Final Phase Reference Comment
9.2330.33liquid, Smectic Bliquid, smectic A transitionTsuji, Sorai, et al., 1982
10.2334.88liquid, Smectic Aliquid, nematicTsuji, Sorai, et al., 1982
3.5336.33liquid, Nematicliquid, isotropicTsuji, Sorai, et al., 1982

References

Tsuji, Sorai, et al., 1982
Tsuji, K.; Sorai, M.; Suga, H., Heat capacity and thermodynamic properties of p'-substituted p-hexyloxybenzylideneaniline. III. p-hexyloxybenzylideneamino-p'-fluorobenzene (HBAF), Mol. Cryst. Liq. Cryst., 1982, 87, 305-317. [all data]