1,3-Diphenyltetramethyldisiloxane

Phase change data

Data compiled as indicated in comments:
BS - Robert L. Brown and Stephen E. Stein
DH - Eugene S. Domalski and Elizabeth D. Hearing

Quantity Value Units Method Reference Comment
Tfus251.KN/ADzhafarov and Kuliev, 1986DH
Tfus250.KN/ADzhafarov and Kuliev, 1983DH

Reduced pressure boiling point

Tboil (K) Pressure (bar) Reference Comment
428. - 431.0.017PCR Inc., 1990BS

Condensed phase thermochemistry data

Data compiled by: Eugene S. Domalski and Elizabeth D. Hearing

Quantity Value Units Method Reference Comment
liquid133.8cal/mol*KN/ADzhafarov and Kuliev, 1986

Constant pressure heat capacity of liquid

Cp,liquid (cal/mol*K) Temperature (K) Reference Comment
121.4298.15Dzhafarov and Kuliev, 1986T = 4 to 300 K. Cp(c) = 40.76 + 1.51T - 5.428x10-4T2 (90 to 160 K); Cp(liq) = 382.004 - 3.75x10-2T + 1.5144x10-3T2 (170 to 300 K).
121.4298.15Dzhafarov and Kuliev, 1983T = 5 to 300 K.

References

Dzhafarov and Kuliev, 1986
Dzhafarov, O.I.; Kuliev, A.M., Heat capacity and thermodynamic properties of disiloxanes, Dokl. Akad. Nauk. Azerb., 1986, SSR 42, 56-59. [all data]

Dzhafarov and Kuliev, 1983
Dzhafarov, O.I.; Kuliev, A.M., Thermodynamic properties of 1,1,3,3-tetramethyl-1,3-diphenyldisiloxane in the range 5 to 300 K, Deposited Doc. VINITI, 1983, 3143-83, 1-9. [all data]

PCR Inc., 1990
PCR Inc., Research Chemicals Catalog 1990-1991, PCR Inc., Gainesville, FL, 1990, 1. [all data]