Nitroguanidine

Phase change data

Data compiled by: William E. Acree, Jr., James S. Chickos

Quantity Value Units Method Reference Comment
Δsub142.7 ± 2.0kJ/molMECundall, Frank Palmer, et al., 1978Based on data from 402. - 473. K.

References

Cundall, Frank Palmer, et al., 1978
Cundall, Robert B.; Frank Palmer, T.; Wood, Colin E.C., Vapour pressure measurements on some organic high explosives, J. Chem. Soc., Faraday Trans. 1, 1978, 74, 0, 1339, https://doi.org/10.1039/f19787401339 . [all data]