5-Hydroxyindoleacetic acid, 3TMS derivative

Van Den Dool and Kratz RI, non-polar column, temperature ramp

View large format table.

Column type Active phase I Reference Comment
CapillaryDB-12199.Hoffmann, Aramaki, et al., 198930. m/0.53 mm/1. μm, He, 4. K/min; Tstart: 70. C; Tend: 290. C
CapillarySE-522239.Lefevere, Verhaeghe, et al., 198925. m/0.32 mm/0.52 μm, He, 5. K/min; Tstart: 70. C; Tend: 270. C
CapillaryCP Sil 5 CB2168.Wurth, Kumps, et al., 1989N2, 60. C @ 0.5 min, 6. K/min, 280. C @ 5. min
PackedOV-12200.Tanaka, Hine, et al., 1980N2, 100-120 mesh, 70. C @ 0.5 min, 28. K/min; Column length: 1.8 m; Tend: 290. C
PackedOV-12204.Butts, 1972He, Chromosorb W HP (80-100 mesh), 10. K/min; Column length: 2. m; Tstart: 100. C; Tend: 325. C

Van Den Dool and Kratz RI, non-polar column, custom temperature program

View large format table.

Column type Active phase I Reference Comment
CapillaryDB-12199.Tsai, Oliphant, et al., 1985He; Program: not specified

Normal alkane RI, non-polar column, temperature ramp

View large format table.

Column type Active phase I Reference Comment
CapillaryHP-5MS2249.Lee, Yanamandra, et al., 200230. m/0.25 mm/0.25 μm, He, 70. C @ 3. min, 4. K/min, 280. C @ 3. min
PackedOV-12190.Francis, Smith, et al., 1980He, 10. K/min; Column length: 1.5 m; Tstart: 180. C; Tend: 320. C

References

Hoffmann, Aramaki, et al., 1989
Hoffmann, G.; Aramaki, S.; Blum-Hoffmann, E.; Nyhan, W.L.; Sweetman, L., Quantitative analysis for organic acids in biological samples: batch isolation followed by gas chromatographic-mass spectrometric analysis, Clin. Chem., 1989, 35, 4, 587-595. [all data]

Lefevere, Verhaeghe, et al., 1989
Lefevere, M.F.; Verhaeghe, B.J.; Declerck, D.H.; Van Bocxlaer, J.F.; De Leenheer, A.P.; De Sagher, R.M., Metabolic Profiling of Urinary Organic Acids by Single and Multicolumn Capillary Gas Chromatography, J. Chromatogr. Sci., 1989, 27, 1, 23-29, https://doi.org/10.1093/chromsci/27.1.23 . [all data]

Wurth, Kumps, et al., 1989
Wurth, C.; Kumps, A.; Mardens, Y., Urinary organic acids: Retention indices on two capillary gas chromatography columns, J. Chromatogr., 1989, 491, 186-192, https://doi.org/10.1016/S0378-4347(00)82831-5 . [all data]

Tanaka, Hine, et al., 1980
Tanaka, K.; Hine, D.G.; West-Dull, A.; Lynn, T.B., Gas-chromatographic method of analysis for urinary organic acids. I. Retention indices of 155 metabolically important compounds, Clin. Chem., 1980, 26, 13, 1839-1846. [all data]

Butts, 1972
Butts, W.C., Two-Column Gas Chromatography of Trimethylsilyl Derivatives of Biochemically Significant Compounds, Anal. Biochemistry, 1972, 46, 1, 187-199, https://doi.org/10.1016/0003-2697(72)90411-3 . [all data]

Tsai, Oliphant, et al., 1985
Tsai, M.Y.; Oliphant, C.; Josephson, M.W., Identification of Metabolites Diagnostic for Organic Acidurias by Simultaneous Dual-Column Capillary Gas Chromatography, J. Chromatogr., 1985, 341, 1-10, https://doi.org/10.1016/S0378-4347(00)84004-9 . [all data]

Lee, Yanamandra, et al., 2002
Lee, B.Y.; Yanamandra, K.; Thurmon, T.F., Quantitative estimation of organic analytes with a capillary column, Am. Clin. Lab., 2002, May, 30-34. [all data]

Francis, Smith, et al., 1980
Francis, P.; Smith, I.; Finnie, M.D.A., Mass spectrometric and chromatographic characteristics of neutral and acidic 5-methoxyindoles and some related compounds, Biomed. Mass Spectrom., 1980, 7, 7, 294-300, https://doi.org/10.1002/bms.1200070706 . [all data]