Heptadecane, 4-propyl-

Phase change data

Data compiled as indicated in comments:
TRC - Thermodynamics Research Center, NIST Boulder Laboratories, Chris Muzny director
AC - William E. Acree, Jr., James S. Chickos

Quantity Value Units Method Reference Comment
Tfus270.65KN/AAnonymous, 1968TRC
Tfus229.7KN/AAnonymous, 1952Uncertainty assigned by TRC = 10. K; TRC
Tfus270.7KN/ASchiessler, 1947Uncertainty assigned by TRC = 10. K; TRC

Enthalpy of vaporization

ΔvapH (kJ/mol) Temperature (K) Method Reference Comment
79.2440.A,MGStephenson and Malanowski, 1987Based on data from 425. - 459. K. See also Schiessler and Whitmore, 1955.; AC

In addition to the Thermodynamics Research Center (TRC) data available from this site, much more physical and chemical property data is available from the following TRC products:

References

Anonymous, 1968
Anonymous, R., Properties of hydrocarbon of high molecular weight, Am. Pet. Inst. Res. Proj. 42, Penn. State Univ., 1968. [all data]

Anonymous, 1952
Anonymous, R., , Physical Properties of Chemical Substances, Dow Chemical Co., 1952. [all data]

Schiessler, 1947
Schiessler, R.W., , Am. Pet. Inst. Res. Proj. 42, Twelfth Meeting, 1947. [all data]

Stephenson and Malanowski, 1987
Stephenson, Richard M.; Malanowski, Stanislaw, Handbook of the Thermodynamics of Organic Compounds, 1987, https://doi.org/10.1007/978-94-009-3173-2 . [all data]

Schiessler and Whitmore, 1955
Schiessler, R.W.; Whitmore, F.C., Properties of High Molecular Weight Hydrocarbons, Ind. Eng. Chem., 1955, 47, 8, 1660-1665, https://doi.org/10.1021/ie50548a054 . [all data]