Octadecane, 2,6,10,14-tetramethyl-

Kovats' RI, non-polar column, isothermal

View large format table.

Column type Active phase Temperature (C) I Reference Comment
CapillarySE-30200.1984.Shlyakhov, 1984
CapillaryApiezon L200.1959.Shlyakhov, 1984
CapillarySE-30100.1984.Shlyakhov, Koreshkova, et al., 1975
CapillarySE-30200.1989.Shlyakhov, Koreshkova, et al., 1975
CapillaryApiezon L100.1962.Shlyakhov, Koreshkova, et al., 1975
CapillaryApiezon L200.1962.Shlyakhov, Koreshkova, et al., 1975

Kovats' RI, non-polar column, custom temperature program

View large format table.

Column type Active phase I Reference Comment
CapillaryApiezon L1957.Shlyakhov, 1984Program: not specified
CapillaryApiezon L1959.Shlyakhov, 1984Program: not specified
CapillaryApiezon L1959.Shlyakhov, 1984Program: not specified
CapillaryApiezon L1960.Shlyakhov, 1984Program: not specified
CapillaryApiezon L1960.Shlyakhov, 1984Program: not specified
CapillaryApiezon L1970.Shlyakhov, 1984Program: not specified

Normal alkane RI, non-polar column, temperature ramp

View large format table.

Column type Active phase I Reference Comment
CapillaryCP-Sil 51987.Damste, ten Haven, et al., 198525. m/0.32 mm/0.13 μm, Helium, 4. K/min; Tstart: 130. C; Tend: 330. C
CapillaryApieson L1960.Albaigès, Borbón, et al., 1981He, Gas-Chrom Q, 6. K/min; Column length: 50. m; Column diameter: 0.25 mm; Tstart: 120. C; Tend: 280. C

Normal alkane RI, non-polar column, custom temperature program

View large format table.

Column type Active phase I Reference Comment
CapillarySqualane1957.Petrov, 1984Program: not specified
CapillaryOV-1, SE-30, Methyl silicone, SP-2100, OV-101, DB-1, etc.1984.Waggott and Davies, 1984Hydrogen; Column length: 50. m; Column diameter: 0.32 mm; Program: not specified

References

Shlyakhov, 1984
Shlyakhov, A.F., Gas chromatography in organic geochemistry, Nedra, Moscow, 1984, 221. [all data]

Shlyakhov, Koreshkova, et al., 1975
Shlyakhov, A.F.; Koreshkova, R.I.; Telkova, M.S., Gas Chromatography of Isoprenoid Alkanes, J. Chromatogr., 1975, 104, 2, 337-349, https://doi.org/10.1016/S0021-9673(00)91857-0 . [all data]

Damste, ten Haven, et al., 1985
Damste, J.S.S.; ten Haven, H.L.; de Leeuw, J.W.; Schenck, P.A., Organic geochemical studies of a Messinian evaporitic basin, northern Apennines (Italy) - II. Isoprenoid and n-alkyl thiophenes and thiolanes, Adv. Org. Geochem., 1985, 10, 4-6, 791-805, https://doi.org/10.1016/S0146-6380(86)80016-X . [all data]

Albaigès, Borbón, et al., 1981
Albaigès, J.; Borbón, J.; Gassiot, M., Gas chromatographic-mass spectrometric identification of geochemically significant isoalkane hydrocarbons, J. Chromatogr., 1981, 204, 491-498, https://doi.org/10.1016/S0021-9673(00)81696-9 . [all data]

Petrov, 1984
Petrov, A.A., Hydrocarbons of petroleum, Nauka (publishing house), Moscow, 1984, 263. [all data]

Waggott and Davies, 1984
Waggott, A.; Davies, I.W., Identification of organic pollutants using linear temperature programmed retention indices (LTPRIs) - Part II, 1984, retrieved from http://dwi.defra.gov.uk/research/completed-research/reports/dwi0383.pdf. [all data]