2-Butanone, 4-(4-hydroxyphenyl)-

Van Den Dool and Kratz RI, non-polar column, temperature ramp

View large format table.

Column type Active phase I Reference Comment
CapillaryHP-5MS1554.Lalel, Singh, et al., 200360. m/0.25 mm/0.25 μm, He, 40. C @ 1. min, 3. K/min, 310. C @ 20. min
CapillaryDB-51555.Zhou, Wintersteen, et al., 200215. m/0.32 mm/0.5 μm, 30. C @ 2. min, 10. K/min, 225. C @ 20. min
CapillaryDB-51550.Nogueira, Bittrich, et al., 200130. m/0.25 mm/0.25 μm, H2, 3. K/min; Tstart: 60. C; Tend: 240. C

Van Den Dool and Kratz RI, polar column, temperature ramp

View large format table.

Column type Active phase I Reference Comment
CapillaryDB-Wax2982.Wirth, Guo, et al., 200130. m/0.32 mm/0.5 μm, He, 60. C @ 3. min, 3. K/min, 245. C @ 20. min
CapillaryCP-Wax 58CB2952.Pabst, Barron, et al., 199130. m/0.25 mm/0.22 μm, He, 3. K/min; Tstart: 40. C; Tend: 220. C

Van Den Dool and Kratz RI, polar column, custom temperature program

View large format table.

Column type Active phase I Reference Comment
CapillaryStabilwax3000.Klesk, Qian, et al., 200430. m/0.32 mm/1. μm, He; Program: 40C (2min) => 5C/min => 100C => 4C/min => 230C (10min)

Normal alkane RI, non-polar column, temperature ramp

View large format table.

Column type Active phase I Reference Comment
CapillaryOV-1011498.Friedrich, Acree, et al., 20016. K/min; Column length: 15. m; Column diameter: 0.32 mm; Tstart: 35. C; Tend: 250. C
CapillaryOV-1011498.Roberts and Acree, 199635. C @ 3. min, 6. K/min; Column length: 12. m; Column diameter: 0.32 mm; Tend: 225. C
CapillaryOV-1011490.Roberts and Acree, 199635. C @ 3. min, 6. K/min; Column length: 12. m; Column diameter: 0.32 mm; Tend: 225. C

Normal alkane RI, polar column, temperature ramp

View large format table.

Column type Active phase I Reference Comment
CapillaryDB-Wax2970.Kishimoto, Wanikawa, et al., 200615. m/0.32 mm/0.25 μm, He, 6. K/min, 230. C @ 20. min; Tstart: 40. C

References

Lalel, Singh, et al., 2003
Lalel, H.J.D.; Singh, Z.; Chye Tan, S., Glycosidically-bound aroma volatile compounds in the skin and pulp of 'Kensington Pride' mango fruit at different stages of maturity, Postharvest Biol. Technol., 2003, 29, 2, 205-218, https://doi.org/10.1016/S0925-5214(02)00250-8 . [all data]

Zhou, Wintersteen, et al., 2002
Zhou, Q.; Wintersteen, C.L.; Cadwallader, K.R., Identification and quantification of aroma-active components that contribute to the distinct malty flavor of buckwheat honey, J. Agric. Food Chem., 2002, 50, 7, 2016-2021, https://doi.org/10.1021/jf011436g . [all data]

Nogueira, Bittrich, et al., 2001
Nogueira, P.C.L.; Bittrich, V.; Shepherd, G.J.; Lopes, A.V.; Marsaioli, A.J., The ecological and taxonomic importance of flower volatiles of Clusia species (Guttiferae), Phytochemistry, 2001, 56, 5, 443-452, https://doi.org/10.1016/S0031-9422(00)00213-2 . [all data]

Wirth, Guo, et al., 2001
Wirth, J.; Guo, W.; Baumes, R.; Günata, Z., Volatile compounds released by enzymatic hydrolysis of glycoconjugates of leaves and grape berries from Vitis vinifera muscat of Alexandria and Shiraz cultivars, J. Agric. Food Chem., 2001, 49, 6, 2917-2923, https://doi.org/10.1021/jf001398l . [all data]

Pabst, Barron, et al., 1991
Pabst, A.; Barron, D.; Etiévant, P.; Schreier, P., Studies on the enzymatic hydrolysis of bound aroma constituents from raspberry fruit pulp, J. Agric. Food Chem., 1991, 39, 1, 173-175, https://doi.org/10.1021/jf00001a034 . [all data]

Klesk, Qian, et al., 2004
Klesk, K.; Qian, M.; Martin, R.R., Aroma extract dilution analysis of cv. meeker (Rubus idaeus L.) red raspberries from Oregon and Washington, J. Agric. Food Chem., 2004, 52, 16, 5155-5161, https://doi.org/10.1021/jf0498721 . [all data]

Friedrich, Acree, et al., 2001
Friedrich, J.E.; Acree, T.E.; Lavin, E.H., Selecting standards for gas chromatography - olfactometry, Am. Chem. Soc. Symp. Ser., 2001, 782, 148-155. [all data]

Roberts and Acree, 1996
Roberts, D.D.; Acree, T.E., Effects of heating and cream addition on fresh raspberry aroma using a retronasal aroma simulator and gas chromatography olfactometry, J. Agric. Food Chem., 1996, 44, 12, 3919-3925, https://doi.org/10.1021/jf950701t . [all data]

Kishimoto, Wanikawa, et al., 2006
Kishimoto, T.; Wanikawa, A.; Kono, K.; Shibata, K., Comparison of the Odor-Active Compounds in Unhopped Beer and Beers Hopped with Different Hop Varieties, J. Agric. Food Chem., 2006, 54, 23, 8855-8861, https://doi.org/10.1021/jf061342c . [all data]