1,7-Heptanediol, 2TMS derivative

Gas phase ion energetics data

Data compiled by: Sharon G. Lias, Rhoda D. Levin, and Sherif A. Kafafi

Appearance energy determinations

Ion AE (eV) Other Products MethodReferenceComment
C12H29O2Si2+9.4 ± 0.1CH3EIKoppel, Schwarz, et al., 1974

References

Koppel, Schwarz, et al., 1974
Koppel, C.; Schwarz, H.; Bohlmann, F., Energetische betrachtungen zur intramolekularen solvatisierung von ionen bei der elektronenstossinduzierten fragmentierung von α,ω-bis-(trimethylsilyl)-athern, Org. Mass Spectrom., 1974, 9, 567. [all data]