3-Nonanone, 2-methyl-

Phase change data

Data compiled as indicated in comments:
TRC - Thermodynamics Research Center, NIST Boulder Laboratories, Chris Muzny director
BS - Robert L. Brown and Stephen E. Stein

Quantity Value Units Method Reference Comment
Tboil473.KN/APickard and Kenyon, 1912Uncertainty assigned by TRC = 4. K; TRC

Reduced pressure boiling point

Tboil (K) Pressure (bar) Reference Comment
474.20.933Weast and Grasselli, 1989BS

In addition to the Thermodynamics Research Center (TRC) data available from this site, much more physical and chemical property data is available from the following TRC products:

Normal alkane RI, polar column, custom temperature program

View large format table.

Column type Active phase I Reference Comment
CapillaryDB-Wax1415.Caldentey, Daria Fumi, et al., 199830. m/0.25 mm/0.25 μm, He; Program: 25C(8min) => 4C/min => 60C => 6C/min => 160C => 20C/min => 200C

References

Pickard and Kenyon, 1912
Pickard, R.H.; Kenyon, J., Investigations on the dependence of rotatory power on chemical constitution: II the rotations of some secondary alcohols containing the isopropyl group, J. Chem. Soc., 1912, 101, 620-38. [all data]

Weast and Grasselli, 1989
CRC Handbook of Data on Organic Compounds, 2nd Editon, Weast,R.C and Grasselli, J.G., ed(s)., CRC Press, Inc., Boca Raton, FL, 1989, 1. [all data]