Pentanedinitrile

Condensed phase thermochemistry data

Data compiled by: Eugene S. Domalski and Elizabeth D. Hearing

Quantity Value Units Method Reference Comment
liquid239.45J/mol*KN/AClever, Wulff, et al., 1965

Constant pressure heat capacity of liquid

Cp,liquid (J/mol*K) Temperature (K) Reference Comment
186.26298.15Clever, Wulff, et al., 1965T = 5 to 350 K.

Phase change data

Data compiled as indicated in comments:
BS - Robert L. Brown and Stephen E. Stein
TRC - Thermodynamics Research Center, NIST Boulder Laboratories, Chris Muzny director
AC - William E. Acree, Jr., James S. Chickos
DH - Eugene S. Domalski and Elizabeth D. Hearing

Quantity Value Units Method Reference Comment
Tboil559.2KN/AWeast and Grasselli, 1989BS
Tboil559.35KN/APerkin, 1889Uncertainty assigned by TRC = 3. K; TRC
Quantity Value Units Method Reference Comment
Tfus243.6KN/AVan de Vloed, 1939Uncertainty assigned by TRC = 0.6 K; TRC
Quantity Value Units Method Reference Comment
Ttriple244.21KN/AClever, Wulff, et al., 1965, 2Uncertainty assigned by TRC = 0.02 K; TRC

Enthalpy of vaporization

ΔvapH (kcal/mol) Temperature (K) Method Reference Comment
14.4379.AStephenson and Malanowski, 1987Based on data from 364. - 560. K.; AC
16.0290.AStephenson and Malanowski, 1987Based on data from 277. - 303. K. See also Dykyj, 1972 and Woodman, Murbach, et al., 1960.; AC

Enthalpy of fusion

ΔfusH (kcal/mol) Temperature (K) Method Reference Comment
3.0079244.21N/AClever, Wulff, et al., 1965DH
2.875242.DSCBadea, Blanco, et al., 2007AC
3.009244.2N/ADomalski and Hearing, 1996AC

Entropy of fusion

ΔfusS (cal/mol*K) Temperature (K) Reference Comment
12.32244.21Clever, Wulff, et al., 1965DH

In addition to the Thermodynamics Research Center (TRC) data available from this site, much more physical and chemical property data is available from the following TRC products:

References

Clever, Wulff, et al., 1965
Clever, H.L.; Wulff, C.A.; Westrum, E.F., Jr., Glutaronitrile. Calorimetrically determined thermal properties from 5 to 350°K. and statisticall gaseous entropy, J. Phys. Chem., 1965, 69, 1983-1988. [all data]