Cyclohexane, 1-methyl-2-pentyl-

Phase change data

Data compiled by: Thermodynamics Research Center, NIST Boulder Laboratories, Chris Muzny director

Quantity Value Units Method Reference Comment
Tboil490.4KN/AColonge and Berthoud, 1952Uncertainty assigned by TRC = 4. K
Tboil490.6KN/ASignaigo and Cramer, 1933Uncertainty assigned by TRC = 4. K

In addition to the Thermodynamics Research Center (TRC) data available from this site, much more physical and chemical property data is available from the following TRC products:

References

Colonge and Berthoud, 1952
Colonge, J.; Berthoud, J., The Preparation of Several Pure Hydrocarbons, Bull. Soc. Chim. Fr., 1952, 1952, 211. [all data]

Signaigo and Cramer, 1933
Signaigo, F.K.; Cramer, P.L., The preparation of some mono- and dialkylcylohexanes, J. Am. Chem. Soc., 1933, 55, 3326-32. [all data]