Glycerol 1-palmitate

Condensed phase thermochemistry data

Data compiled as indicated in comments:
ALS - Hussein Y. Afeefy, Joel F. Liebman, and Stephen E. Stein
DH - Eugene S. Domalski and Elizabeth D. Hearing

Quantity Value Units Method Reference Comment
Δfsolid-1262.0 ± 1.9kJ/molCcbSilbert, Daubert, et al., 1965Reanalyzed by Cox and Pilcher, 1970, Original value = -1281.6 ± 2.4 kJ/mol; ALS
Δfsolid-1279.6kJ/molCcbClarke and Stegeman, 1940ALS
Quantity Value Units Method Reference Comment
Δcsolid-11626.0 ± 2.1kJ/molCcbSilbert, Daubert, et al., 1965Corresponding Δfsolid = -1281.5 kJ/mol (simple calculation by NIST; no Washburn corrections); ALS
Δcsolid-11626.4 ± 1.5kJ/molCcbClarke and Stegeman, 1940Corresponding Δfsolid = -1281.1 kJ/mol (simple calculation by NIST; no Washburn corrections); ALS

Constant pressure heat capacity of solid

Cp,solid (J/mol*K) Temperature (K) Reference Comment
566.9298.Silbert, Daubert, et al., 1965βL form.; DH
602.9298.Clarke and Stegeman, 1940DH

References

Silbert, Daubert, et al., 1965
Silbert, L.S.; Daubert, B.F.; Mason, L.S., The heats of combustion, formation, and isomerization of isomeric monoglycerides, J. Phys. Chem., 1965, 69, 2887-2894. [all data]

Cox and Pilcher, 1970
Cox, J.D.; Pilcher, G., Thermochemistry of Organic and Organometallic Compounds, Academic Press, New York, 1970, 1-636. [all data]

Clarke and Stegeman, 1940
Clarke, T.H.; Stegeman, G., α- And β-monopalmitin, heats of combustion and specific heats at 25°, J. Am. Chem. Soc., 1940, 62, 1815-1817. [all data]