Aniline hydrobromide

Condensed phase thermochemistry data

Data compiled by: Eugene S. Domalski and Elizabeth D. Hearing

Constant pressure heat capacity of solid

Cp,solid (J/mol*K) Temperature (K) Reference Comment
159.62298.75Suga, 1961T = -74 to 67°C. Value is unsmoothed experimental datum.

References

Suga, 1961
Suga, H., On the orientational order-disorder transition in crystalline aniline hydrobromide, Bull. Chem. Soc. Jpn., 1961, 34, 426-433. [all data]