Bicyclo[5.1.0]octane, 8-(1-methylethylidene)-

Normal alkane RI, non-polar column, custom temperature program

View large format table.

Column type Active phase I Reference Comment
CapillaryCBP-51099.Cheriti, Saad, et al., 200730. m/0.25 mm/0.25 μm, He; Program: 60C(2min) => 3C/min => 240C => 10C/min => 300C

References

Cheriti, Saad, et al., 2007
Cheriti, A.; Saad, A.; Belboukhari, N.; Ghezali, S., The essential oil composition of Bubonium graveolens (Forssk.) Maire from the algerian Sahara, Flavour Fragr. J., 2007, 22, 4, 286-288, https://doi.org/10.1002/ffj.1794 . [all data]