t-Butyl nitrite

Condensed phase thermochemistry data

Data compiled by: Hussein Y. Afeefy, Joel F. Liebman, and Stephen E. Stein

Quantity Value Units Method Reference Comment
Δfliquid-206.kJ/molCcbBatt, Christie, et al., 1974
Quantity Value Units Method Reference Comment
Δcliquid-2654. ± 3.kJ/molCcbBatt, Christie, et al., 1974

Gas phase ion energetics data

Data evaluated by: Edward P. Hunter and Sharon G. Lias

Quantity Value Units Method Reference Comment
Proton affinity (review)863.9kJ/molN/AHunter and Lias, 1998
Quantity Value Units Method Reference Comment
Gas basicity831.4kJ/molN/AHunter and Lias, 1998

Gas phase thermochemistry data

Data compiled by: Hussein Y. Afeefy, Joel F. Liebman, and Stephen E. Stein

Quantity Value Units Method Reference Comment
Δfgas-41.0 ± 1.0kcal/molCcbBatt, Christie, et al., 1974

References

Batt, Christie, et al., 1974
Batt, L.; Christie, K.; Milne, R.T.; Summers, A.J., Heats of formation of C1-C4 alkyl nitrites (RONO) and their RO-NO bond dissociation energies, Int. J. Chem. Kinet., 1974, 6, 877-886. [all data]