Heptanolactone

Gas phase thermochemistry data

Data compiled by: Hussein Y. Afeefy, Joel F. Liebman, and Stephen E. Stein

Quantity Value Units Method Reference Comment
Δfgas-411. ± 3.kJ/molCmWiberg and Waldron, 1991Heat of reduction

Phase change data

Data compiled as indicated in comments:
ALS - Hussein Y. Afeefy, Joel F. Liebman, and Stephen E. Stein
DRB - Donald R. Burgess, Jr.
AC - William E. Acree, Jr., James S. Chickos

Quantity Value Units Method Reference Comment
Δvap12.8 ± 0.3kcal/molVWiberg and Waldron, 1991Heat of reduction; ALS
Δvap12.9kcal/molN/AWiberg and Waldron, 1991DRB
Δvap12.7 ± 0.31kcal/molMMWiberg and Waldron, 1991Based on data from 369. - 390. K.; AC

Enthalpy of vaporization

ΔvapH (kcal/mol) Temperature (K) Method Reference Comment
11.5 ± 0.07379.MMWiberg and Waldron, 1991Based on data from 368. - 390. K.; AC

Condensed phase thermochemistry data

Data compiled by: Hussein Y. Afeefy, Joel F. Liebman, and Stephen E. Stein

Quantity Value Units Method Reference Comment
Δfliquid-111.1 ± 0.5kcal/molCmWiberg and Waldron, 1991Heat of reduction

References

Wiberg and Waldron, 1991
Wiberg, K.B.; Waldron, R.F., Lactones. 2. Enthalpies of hydrolysis, reduction, and formation of the C4-C13 monocyclic lactones. strain energies and conformations, J. Am. Chem. Soc., 1991, 113, 7697-7705. [all data]