Benzene, 1-(1,1-dimethylethyl)-4-methoxy-

Gas phase ion energetics data

Data compiled as indicated in comments:
LBLHLM - Sharon G. Lias, John E. Bartmess, Joel F. Liebman, John L. Holmes, Rhoda D. Levin, and W. Gary Mallard

Ionization energy determinations

IE (eV) Method Reference Comment
7.77 ± 0.02EIOrlov, Misharev, et al., 1986LBLHLM

Appearance energy determinations

Ion AE (eV) Other Products MethodReferenceComment
C10H13O+9.5 ± 0.1CH3EIOrlov, Misharev, et al., 1986LBLHLM

References

Orlov, Misharev, et al., 1986
Orlov, V.; Misharev, A.; Takhistox, V., Determination of the enthalpy of formation of para-substituted α,α-dimethyl cations in the gas phase, Izv. Akad. Nauk SSSR Ser. Khim., 1986, 9, 2006. [all data]