1,2-Bis(ethylthio)ethane

Phase change data

Data compiled as indicated in comments:
ALS - Hussein Y. Afeefy, Joel F. Liebman, and Stephen E. Stein
DRB - Donald R. Burgess, Jr.
AC - William E. Acree, Jr., James S. Chickos

Quantity Value Units Method Reference Comment
Δvap59.5kJ/molN/AMajer and Svoboda, 1985
Δvap59.50 ± 0.25kJ/molCMansson, 1974ALS
Δvap59.5kJ/molN/AMansson, 1974DRB
Δvap50.8 ± 0.2kJ/molCMansson, 1974AC
Δvap59.5 ± 0.1kJ/molCMansson, 1974AC

Kovats' RI, non-polar column, isothermal

View large format table.

Column type Active phase Temperature (C) I Reference Comment
PackedApiezon M130.1180.Garbuzov, Misharina, et al., 1985He or N2, Chromosorb W, AW-DMCS; Column length: 2.1 m

References

Majer and Svoboda, 1985
Majer, V.; Svoboda, V., Enthalpies of Vaporization of Organic Compounds: A Critical Review and Data Compilation, Blackwell Scientific Publications, Oxford, 1985, 300. [all data]

Mansson, 1974
Mansson, M., Non-bonded sulphur-sulphur interactions in 3,5-dithiaheptane and 3,6-dithiaoctane, J. Chem. Thermodyn., 1974, 6, 1153-1159. [all data]