1-Aminotetrazole

Phase change data

Data compiled as indicated in comments:
ALS - Hussein Y. Afeefy, Joel F. Liebman, and Stephen E. Stein
DRB - Donald R. Burgess, Jr.

Quantity Value Units Method Reference Comment
Δsub116.0 ± 1.2kJ/molVKozyro, Simirskii, et al., 1990ALS
Δsub116.0kJ/molN/AKozyro, Simirskii, et al., 1990DRB

References

Kozyro, Simirskii, et al., 1990
Kozyro, A.A.; Simirskii, V.V.; Krasulin, A.P.; Sevruk, V.M.; Kabo, G.Ya.; Frenkel, M.L.; Gaponik, P.N.; Grigor'ev, Yu.V., Thermodynamic properties of tetrazole derivatives in different aggregation states, Russ. J. Phys. Chem. (Engl. Transl.), 1990, 64, 348-350. [all data]