Pentane, 2,2,4-trimethyl-4-nitro-

Phase change data

Data compiled as indicated in comments:
TRC - Thermodynamics Research Center, NIST Boulder Laboratories, Chris Muzny director
AC - William E. Acree, Jr., James S. Chickos

Quantity Value Units Method Reference Comment
Tfus296.75KN/AKornblum, Clutter, et al., 1956Uncertainty assigned by TRC = 0.5 K; TRC
Quantity Value Units Method Reference Comment
Δvap54.7 ± 0.8kJ/molGSVerevkin, 1997Based on data from 288. - 324. K.; AC

Enthalpy of vaporization

ΔvapH (kJ/mol) Temperature (K) Method Reference Comment
54.2 ± 0.8306.GSVerevkin, 1997Based on data from 288. - 324. K.; AC

In addition to the Thermodynamics Research Center (TRC) data available from this site, much more physical and chemical property data is available from the following TRC products:

References

Kornblum, Clutter, et al., 1956
Kornblum, N.; Clutter, R.J.; Jones, W.J., Synthesis of Tertiary Nitroparaffins, J. Am. Chem. Soc., 1956, 78, 4003. [all data]

Verevkin, 1997
Verevkin, Sergey P., Thermochemistry of nitro compounds. Experimental standard enthalpies of formation and improved group-additivity values, Thermochimica Acta, 1997, 307, 1, 17-25, https://doi.org/10.1016/S0040-6031(97)00359-6 . [all data]