2-Propanone, 1,3-dichloro-

Phase change data

Data compiled as indicated in comments:
BS - Robert L. Brown and Stephen E. Stein
AC - William E. Acree, Jr., James S. Chickos

Quantity Value Units Method Reference Comment
Tboil446.6KN/AWeast and Grasselli, 1989BS

Enthalpy of vaporization

ΔvapH (kJ/mol) Temperature (K) Method Reference Comment
49.6363.AStephenson and Malanowski, 1987Based on data from 348. - 445. K. See also Smith and Thornsberry, 1970.; AC

Antoine Equation Parameters

log10(P) = A − (B / (T + C))
    P = vapor pressure (bar)
    T = temperature (K)

View plot Requires a JavaScript / HTML 5 canvas capable browser.

Temperature (K) A B C Reference Comment
348. - 445.4.900091937.489-49.092Smith and Thornsberry, 1970Coefficents calculated by NIST from author's data.

Normal alkane RI, non-polar column, temperature ramp

Data compiled by: NIST Mass Spectrometry Data Center, William E. Wallace, director

Column type CapillaryCapillary
Active phase OV-101OV-101
Column length (m) 25.25.
Carrier gas NitrogenNitrogen
Substrate
Column diameter (mm) 0.200.20
Phase thickness (μm) 0.250.25
Tstart (C) 40.40.
Tend (C) 220.240.
Heat rate (K/min) 6.6.
Initial hold (min)
Final hold (min)
I 866.870.
ReferenceZenkevich, Eliseenkov, et al., 2011Zenkevich, Eliseenkov, et al., 2011, 2
Comment MSDC-RI MSDC-RI

References

Weast and Grasselli, 1989
CRC Handbook of Data on Organic Compounds, 2nd Editon, Weast,R.C and Grasselli, J.G., ed(s)., CRC Press, Inc., Boca Raton, FL, 1989, 1. [all data]

Stephenson and Malanowski, 1987
Stephenson, Richard M.; Malanowski, Stanislaw, Handbook of the Thermodynamics of Organic Compounds, 1987, https://doi.org/10.1007/978-94-009-3173-2 . [all data]

Smith and Thornsberry, 1970
Smith, Edgar Dumont; Thornsberry, Willis L., Characterization data for chloroacetone, 1,1-dichloroacetone, and 1,3-dichloroacetone, J. Chem. Eng. Data, 1970, 15, 2, 296-297, https://doi.org/10.1021/je60045a002 . [all data]