2-Cyclopenten-1-one, 2-hydroxy-3,5,5-trimethyl

Van Den Dool and Kratz RI, non-polar column, temperature ramp

Data compiled by: NIST Mass Spectrometry Data Center, William E. Wallace, director

Column type Capillary
Active phase OV-101
Column length (m) 50.
Carrier gas N2
Substrate
Column diameter (mm) 0.22
Phase thickness (μm)
Tstart (C) 80.
Tend (C) 200.
Heat rate (K/min) 2.
Initial hold (min)
Final hold (min)
I 1040.
ReferenceMihara and Nishimura, 1989
Comment MSDC-RI

References

Mihara and Nishimura, 1989
Mihara, S.; Nishimura, O., Retention indices of 2-hydroxy-2-cyclopenten-1-ones, J. Hi. Res. Chromatogr., 1989, 12, 11, 763-764, https://doi.org/10.1002/jhrc.1240121116 . [all data]