3-Ethoxy-2-cyclohexen-1-one

Gas phase ion energetics data

Data compiled by: Sharon G. Lias, Rhoda D. Levin, and Sherif A. Kafafi

Ionization energy determinations

IE (eV) Method Reference
8.69 ± 0.05PEHouk, Davis, et al., 1973

References

Houk, Davis, et al., 1973
Houk, K.N.; Davis, L.P.; Newkome, G.R.; Duke, R.E., Jr.; Nauman, R.V., Photoelectron spectroscopy of cyclic β-diketones their enolone tautomers, J. Am. Chem. Soc., 1973, 95, 8364. [all data]