Phenol, 2,3,5,6-tetramethyl-

Phase change data

Data compiled as indicated in comments:
TRC - Thermodynamics Research Center, NIST Boulder Laboratories, Chris Muzny director
AC - William E. Acree, Jr., James S. Chickos

Quantity Value Units Method Reference Comment
Tboil520.7KN/AKarr, Estep, et al., 1961Uncertainty assigned by TRC = 4. K; TRC
Tboil520.7KN/AKarr, 1957Uncertainty assigned by TRC = 4. K; TRC
Tboil522.KN/Avon Terres, Gebert, et al., 1955Uncertainty assigned by TRC = 3. K; TRC
Quantity Value Units Method Reference Comment
Tfus390.KN/AKarr, 1957Uncertainty assigned by TRC = 2. K; TRC
Tfus390.KN/AKruber, Raeithel, et al., 1955Uncertainty assigned by TRC = 2. K; TRC
Tfus392.KN/Avon Terres, Gebert, et al., 1955Uncertainty assigned by TRC = 2. K; TRC
Tfus389.KN/ASears and Kitchen, 1949Uncertainty assigned by TRC = 3. K; TRC
Tfus392.KN/AKruber and Schmitt, 1931Uncertainty assigned by TRC = 2. K; TRC

Enthalpy of vaporization

ΔvapH (kJ/mol) Temperature (K) Method Reference Comment
51.2396.AStephenson and Malanowski, 1987Based on data from 381. - 522. K. See also von Terres, Gebert, et al., 1955.; AC

Antoine Equation Parameters

log10(P) = A − (B / (T + C))
    P = vapor pressure (bar)
    T = temperature (K)

View plot Requires a JavaScript / HTML 5 canvas capable browser.

Temperature (K) A B C Reference Comment
381.8 - 522.5.167912705.2072.303von Terres, Gebert, et al., 1955, 2Coefficents calculated by NIST from author's data.

In addition to the Thermodynamics Research Center (TRC) data available from this site, much more physical and chemical property data is available from the following TRC products:

Kovats' RI, non-polar column, temperature ramp

View large format table.

Column type Active phase I Reference Comment
CapillarySE-301287.Medvedovskaya, Tikhomirova, et al., 19977. K/min; Tstart: 50. C; Tend: 320. C

Van Den Dool and Kratz RI, non-polar column, temperature ramp

View large format table.

Column type Active phase I Reference Comment
CapillaryDB-51319.da Silva, Borba, et al., 199930. m/0.25 mm/0.25 μm, H2, 4. K/min; Tstart: 50. C; Tend: 290. C
CapillaryDB-51361.Rostad and Pereira, 198630. m/0.26 mm/0.25 μm, He, 50. C @ 4. min, 6. K/min, 300. C @ 20. min

Normal alkane RI, non-polar column, custom temperature program

View large format table.

Column type Active phase I Reference Comment
CapillaryZB-1 MS1354.Al-Reza, Rahman, et al., 200930. m/0.25 mm/0.25 μm, Helium; Program: 50 0C 3 0C/min -> 150 0C (10 min) 10 0C/min -> 250 0C

Lee's RI, non-polar column, temperature ramp

View large format table.

Column type Active phase I Reference Comment
CapillaryDB-5231.3Donnelly, Abdel-Hamid, et al., 199330. m/0.32 mm/0.25 μm, He, 40. C @ 3. min, 8. K/min, 285. C @ 29.5 min
CapillaryDB-5232.59Rostad and Pereira, 198630. m/0.26 mm/0.25 μm, He, 50. C @ 4. min, 6. K/min, 300. C @ 20. min

References

Karr, Estep, et al., 1961
Karr, C.; Estep, P.A.; Chang, T.-C.L.; Comberiati, H.R., , U. S. Bur. Mines, Bull. 591, 1961. [all data]

Karr, 1957
Karr, C., , U. S. Bur. Mines, Inform. Circ. IC 7802, 1957. [all data]

von Terres, Gebert, et al., 1955
von Terres, E.; Gebert, F.; Hulsemann, H.; Petereit, H.; Toepsch, H.; Ruppert, W., Brennst.-Chem., 1955, 36, 272. [all data]

Kruber, Raeithel, et al., 1955
Kruber, O.; Raeithel, A.; Grigoleit, G., Compounds Proved to Be Present in Coal Tar, Erdoel Kohle, 1955, 8, 637. [all data]

Sears and Kitchen, 1949
Sears, W.C.; Kitchen, L.J., Infrared Studies of Hindered Phenols, J. Am. Chem. Soc., 1949, 71, 4110. [all data]

Kruber and Schmitt, 1931
Kruber, O.; Schmitt, A., Ber. Dtsch. Chem. Ges. B, 1931, 64, 2270. [all data]

Stephenson and Malanowski, 1987
Stephenson, Richard M.; Malanowski, Stanislaw, Handbook of the Thermodynamics of Organic Compounds, 1987, https://doi.org/10.1007/978-94-009-3173-2 . [all data]

von Terres, Gebert, et al., 1955, 2
von Terres, E.; Gebert, F.; Hulsemann, H.; Petereit, H.; Toepsch, H.; Ruppert, W., Zur Kenntnis der physikalisch-chemischen Grundlagen der Gewinnung und Zerlegung der Phenolfraktionen von Steinkohlenteer und Braunkohlenschwelteer. IV. Mitteilung Die Dampfdrucke von Phenol und Phenolderivaten, Brennst.-Chem., 1955, 36, 272-274. [all data]