1,1'-Biphenyl, 2,2',3,4,4',5',6-heptachloro-

Normal alkane RI, non-polar column, custom temperature program

Data compiled by: NIST Mass Spectrometry Data Center, William E. Wallace, director

Column type Capillary
Active phase Apolane
Column length (m) 50.
Carrier gas He
Substrate
Column diameter (mm) 0.25
Phase thickness (μm)
Program 70 0C (2 min) 10 0C/min (6 min) 2 0C/min -> 250 0C
I 2402.
ReferenceBush, Murphy, et al., 1985
Comment MSDC-RI

References

Bush, Murphy, et al., 1985
Bush, B.; Murphy, M.J.; Connor, S.; Snow, J.; Barnard, E., Improvements in Glass Capillary Gas Chromatographic Polychlorobiphenyl Analysis, J. Chromatogr. Sci., 1985, 23, 11, 509-515, https://doi.org/10.1093/chromsci/23.11.509 . [all data]