[1,1'-Biphenyl]-4-carbonitrile, 4'-(heptyloxy)-

Phase change data

Data compiled by: Thermodynamics Research Center, NIST Boulder Laboratories, Chris Muzny director

Quantity Value Units Method Reference Comment
Tfus326.7KN/AHulme and Raynes, 1974Nemactic liquid crystal phase; Uncertainty assigned by TRC = 0.2 K

In addition to the Thermodynamics Research Center (TRC) data available from this site, much more physical and chemical property data is available from the following TRC products:

References

Hulme and Raynes, 1974
Hulme, D.S.; Raynes, E.P., eutectic mixtures of nematic 4'-substituted 4-cyanobiphenyls, J. Chem. Soc., 1974, 1974, 98. [all data]