3,4-Diethoxy-3-cyclobutene-1,2-dione

Gas phase thermochemistry data

Data compiled by: Hussein Y. Afeefy, Joel F. Liebman, and Stephen E. Stein

Quantity Value Units Method Reference Comment
Δfgas-478.5 ± 4.1kJ/molCcbSellers, 1971

References

Sellers, 1971
Sellers, P., Enthalpies of formation of squaric acid and the corresponding diethyl ether, Acta Chem. Scand., 1971, 25, 2194-2198. [all data]