Broxyquinoline

Condensed phase thermochemistry data

Data compiled by: Hussein Y. Afeefy, Joel F. Liebman, and Stephen E. Stein

Quantity Value Units Method Reference Comment
Δfsolid-40.5 ± 2.8kJ/molCcrRibeiro da Silva, Ferrao, et al., 1995HBr(1:600 H2O)
Quantity Value Units Method Reference Comment
Δcsolid-4171.9 ± 2.5kJ/molCcrRibeiro da Silva, Ferrao, et al., 1995HBr(1:600 H2O)

References

Ribeiro da Silva, Ferrao, et al., 1995
Ribeiro da Silva, M.A.V.; Ferrao, M.L.C.C.H.; Alves da Silva, M.R.O., Standard enthalpies of combustion of five halogen-substituted 8-hydroxyquinolines by rotating-bomb calorimetry, J. Chem. Thermodyn., 1995, 27, 633-641. [all data]