N-Methyl-N-phenyl N'-ethyl urea

Condensed phase thermochemistry data

Data compiled by: Hussein Y. Afeefy, Joel F. Liebman, and Stephen E. Stein

Quantity Value Units Method Reference Comment
Δfsolid-304.7 ± 5.9kJ/molCcbTavernier and Lamouroux, 1956Reanalyzed by Cox and Pilcher, 1970, Original value = -293.6 kJ/mol; Author's hf298_condensed=-75.162 kcal/mol
Quantity Value Units Method Reference Comment
Δcsolid-5631.2 ± 5.9kJ/molCcbTavernier and Lamouroux, 1956Reanalyzed by Cox and Pilcher, 1970, Original value = -5642.33 kJ/mol; Author's hf298_condensed=-75.162 kcal/mol

Phase change data

Data compiled by: Thermodynamics Research Center, NIST Boulder Laboratories, Chris Muzny director

Quantity Value Units Method Reference Comment
Tfus310.2KN/ATavernier and Lamouroux, 1956Uncertainty assigned by TRC = 0.00001 K

In addition to the Thermodynamics Research Center (TRC) data available from this site, much more physical and chemical property data is available from the following TRC products:

References

Tavernier and Lamouroux, 1956
Tavernier, P.; Lamouroux, M., Determinations calorimetriques relatives a vingt-six substances organiques, Mem. Poudres, 1956, 38, 65-88. [all data]

Cox and Pilcher, 1970
Cox, J.D.; Pilcher, G., Thermochemistry of Organic and Organometallic Compounds, Academic Press, New York, 1970, 1-636. [all data]